Publicaci�n,Id Anuncio,Id Objeto Digital Anuncio,N� Publicaci�n,Fecha Publicaci�n,Sumario,Administraci�n,Secci�n,Apartado,Anunciante,N� Disposici�n,A�o Publicaci�n,Rango,Fecha Disposici�n,A�o Disposici�n,Categor�a,NPE,URL HTML,URL PDF,P�ginas
BOLETIN,16979,358734,1,2009-01-02 00:00:00.0,Notificaci�n de liquidaci�n de expedientes sancionadores de espect�culos p�blicos.,Comunidad Aut�noma,I. Comunidad Aut�noma,4. Anuncios,Consejer�a de Presidencia y Administraciones P�blicas,0,2009,ANUNCIO,,,Notificaciones,,https://www.borm.es/#/home/anuncio/02-01-2009/16979,https://www.borm.es/services/anuncio/358734/pdf,1
BOLETIN,16980,358735,1,2009-01-02 00:00:00.0,Notificaci�n de acuerdo de inicio de expedientes sancionadores de espect�culos p�blicos.,Comunidad Aut�noma,I. Comunidad Aut�noma,4. Anuncios,Consejer�a de Presidencia y Administraciones P�blicas,0,2009,ANUNCIO,,,Notificaciones - Expediente sancionador,,https://www.borm.es/#/home/anuncio/02-01-2009/16980,https://www.borm.es/services/anuncio/358735/pdf,1
BOLETIN,16981,358736,1,2009-01-02 00:00:00.0,Notificaci�n propuesta de resoluci�n de expedientes sancionadores de espect�culos p�blicos.,Comunidad Aut�noma,I. Comunidad Aut�noma,4. Anuncios,Consejer�a de Presidencia y Administraciones P�blicas,0,2009,ANUNCIO,,,Notificaciones - Expediente sancionador,,https://www.borm.es/#/home/anuncio/02-01-2009/16981,https://www.borm.es/services/anuncio/358736/pdf,1
BOLETIN,16982,358738,1,2009-01-02 00:00:00.0,Notificaci�n de resoluci�n sancionadora de expedientes sancionadores de espect�culos p�blicos.,Comunidad Aut�noma,I. Comunidad Aut�noma,4. Anuncios,Consejer�a de Presidencia y Administraciones P�blicas,0,2009,ANUNCIO,,,Notificaciones - Expediente sancionador,,https://www.borm.es/#/home/anuncio/02-01-2009/16982,https://www.borm.es/services/anuncio/358738/pdf,1
BOLETIN,16983,358721,1,2009-01-02 00:00:00.0,Procedimiento n�mero 772/2008.,Administraci�n de Justicia,III. Administraci�n de Justicia,,De lo Social n�mero Seis de Murcia,0,2009,ANUNCIO,,,Autos,,https://www.borm.es/#/home/anuncio/02-01-2009/16983,https://www.borm.es/services/anuncio/358721/pdf,1
BOLETIN,16984,358722,1,2009-01-02 00:00:00.0,Procedimiento n�mero 934/2008.,Administraci�n de Justicia,III. Administraci�n de Justicia,,De lo Social n�mero Seis de Murcia,0,2009,ANUNCIO,,,Autos,,https://www.borm.es/#/home/anuncio/02-01-2009/16984,https://www.borm.es/services/anuncio/358722/pdf,2
BOLETIN,16985,358723,1,2009-01-02 00:00:00.0,Procedimiento n�mero 809/2008.,Administraci�n de Justicia,III. Administraci�n de Justicia,,De lo Social n�mero Seis de Murcia,0,2009,ANUNCIO,,,Demandas,,https://www.borm.es/#/home/anuncio/02-01-2009/16985,https://www.borm.es/services/anuncio/358723/pdf,1
BOLETIN,16986,358724,1,2009-01-02 00:00:00.0,Procedimiento n�mero 821/2008.,Administraci�n de Justicia,III. Administraci�n de Justicia,,De lo Social n�mero Seis de Murcia,0,2009,ANUNCIO,,,Demandas,,https://www.borm.es/#/home/anuncio/02-01-2009/16986,https://www.borm.es/services/anuncio/358724/pdf,1
BOLETIN,16987,358725,1,2009-01-02 00:00:00.0,Procedimiento n�mero 903/2008.,Administraci�n de Justicia,III. Administraci�n de Justicia,,De lo Social n�mero Seis de Murcia,0,2009,ANUNCIO,,,Demandas,,https://www.borm.es/#/home/anuncio/02-01-2009/16987,https://www.borm.es/services/anuncio/358725/pdf,2
BOLETIN,16988,358680,1,2009-01-02 00:00:00.0,Procedimiento Demanda 393/2008.,Administraci�n de Justicia,III. Administraci�n de Justicia,,De lo Social n�mero Seis de Murcia,0,2009,ANUNCIO,,,Demandas,,https://www.borm.es/#/home/anuncio/02-01-2009/16988,https://www.borm.es/services/anuncio/358680/pdf,1
BOLETIN,16989,358681,1,2009-01-02 00:00:00.0,Autos n.� 907/2008.,Administraci�n de Justicia,III. Administraci�n de Justicia,,De lo Social n�mero Seis de Murcia,0,2009,ANUNCIO,,,Autos,,https://www.borm.es/#/home/anuncio/02-01-2009/16989,https://www.borm.es/services/anuncio/358681/pdf,1
BOLETIN,16990,358693,1,2009-01-02 00:00:00.0,Subvenciones a asociaciones y/o entidades ciudadanas. Expediente n�mero Des-Subv. 2008/05.,Administraci�n Local,IV. Administraci�n Local,,Cartagena,0,2009,ANUNCIO,,,Ayudas/subvenciones - Concesi�n,,https://www.borm.es/#/home/anuncio/02-01-2009/16990,https://www.borm.es/services/anuncio/358693/pdf,1
BOLETIN,16992,358703,1,2009-01-02 00:00:00.0,Decreto n�mero 1.658/08.,Administraci�n Local,IV. Administraci�n Local,,Lorqu�,0,2009,ANUNCIO,,,Anuncios - Inscripciones/Bajas,,https://www.borm.es/#/home/anuncio/02-01-2009/16992,https://www.borm.es/services/anuncio/358703/pdf,1
BOLETIN,16993,358760,1,2009-01-02 00:00:00.0,Exceso de cabida 364/2008.,Administraci�n de Justicia,III. Administraci�n de Justicia,,Primera Instancia n�mero Uno de Jumilla,0,2009,ANUNCIO,,,Expedientes de dominio - Exceso de cabida,,https://www.borm.es/#/home/anuncio/02-01-2009/16993,https://www.borm.es/services/anuncio/358760/pdf,1
BOLETIN,16996,358751,1,2009-01-02 00:00:00.0,Procedimiento: Expediente de dominio. Exceso de cabida 1152/2008,Administraci�n de Justicia,III. Administraci�n de Justicia,,Primera Instancia n�mero Uno de Cartagena,0,2009,ANUNCIO,,,Expedientes de dominio - Exceso de cabida,,https://www.borm.es/#/home/anuncio/02-01-2009/16996,https://www.borm.es/services/anuncio/358751/pdf,1
BOLETIN,17001,358745,1,2009-01-02 00:00:00.0,Notificaci�n de expedientes sancionadores.,Administraci�n General  del Estado,II. Administraci�n General del Estado,2. Direcciones Provinciales de Ministerios,Ministerio del Interior - Jefatura Provincial de Tr�fico de Murcia,0,2009,ANUNCIO,,,Notificaciones - Expediente sancionador,,https://www.borm.es/#/home/anuncio/02-01-2009/17001,https://www.borm.es/services/anuncio/358745/pdf,23
BOLETIN,17002,358695,1,2009-01-02 00:00:00.0,Adjudicaci�n definitiva de contrato de obra. Expediente n�mero OP 8/2008.,Administraci�n Local,IV. Administraci�n Local,,Ceut�,0,2009,ANUNCIO,,,Contrataci�n - Adjudicaciones,,https://www.borm.es/#/home/anuncio/02-01-2009/17002,https://www.borm.es/services/anuncio/358695/pdf,1
BOLETIN,17003,358746,1,2009-01-02 00:00:00.0,Notificaci�n de resoluciones de expedientes sancionadores.,Administraci�n General  del Estado,II. Administraci�n General del Estado,2. Direcciones Provinciales de Ministerios,Ministerio del Interior - Jefatura Provincial de Tr�fico de Murcia,0,2009,ANUNCIO,,,Notificaciones - Expediente sancionador,,https://www.borm.es/#/home/anuncio/02-01-2009/17003,https://www.borm.es/services/anuncio/358746/pdf,22
BOLETIN,17004,358747,1,2009-01-02 00:00:00.0,Notificaci�n de declaraci�n de caducidad del procedimiento de nulidad de permiso de conducir espa�ol procedente de canje.,Administraci�n General  del Estado,II. Administraci�n General del Estado,2. Direcciones Provinciales de Ministerios,Ministerio del Interior - Jefatura Provincial de Tr�fico de Murcia,0,2009,ANUNCIO,,,Notificaciones,,https://www.borm.es/#/home/anuncio/02-01-2009/17004,https://www.borm.es/services/anuncio/358747/pdf,1
BOLETIN,17005,358748,1,2009-01-02 00:00:00.0,Notificaci�n de iniciaci�n de expedientes de nulidad de permiso de conducir con medida cautelar de intervenci�n.,Administraci�n General  del Estado,II. Administraci�n General del Estado,2. Direcciones Provinciales de Ministerios,Ministerio del Interior - Jefatura Provincial de Tr�fico de Murcia,0,2009,ANUNCIO,,,Notificaciones - Expediente sancionador,,https://www.borm.es/#/home/anuncio/02-01-2009/17005,https://www.borm.es/services/anuncio/358748/pdf,1
BOLETIN,17006,358763,1,2009-01-02 00:00:00.0,Procedimiento n�mero 1.306/2008.,Administraci�n de Justicia,III. Administraci�n de Justicia,,De lo Social n�mero Uno de Murcia,0,2009,ANUNCIO,,,Autos,,https://www.borm.es/#/home/anuncio/02-01-2009/17006,https://www.borm.es/services/anuncio/358763/pdf,2
BOLETIN,17007,358764,1,2009-01-02 00:00:00.0,Procedimiento n�mero 1.308/2008.,Administraci�n de Justicia,III. Administraci�n de Justicia,,De lo Social n�mero Uno de Murcia,0,2009,ANUNCIO,,,Autos,,https://www.borm.es/#/home/anuncio/02-01-2009/17007,https://www.borm.es/services/anuncio/358764/pdf,1
BOLETIN,17008,358765,1,2009-01-02 00:00:00.0,Procedimiento n�mero 806/2008.,Administraci�n de Justicia,III. Administraci�n de Justicia,,De lo Social n�mero Uno de Murcia,0,2009,ANUNCIO,,,Autos,,https://www.borm.es/#/home/anuncio/02-01-2009/17008,https://www.borm.es/services/anuncio/358765/pdf,2
BOLETIN,17009,358766,1,2009-01-02 00:00:00.0,Autos n�mero 239/2008.,Administraci�n de Justicia,III. Administraci�n de Justicia,,De lo Social n�mero Uno de Murcia,0,2009,ANUNCIO,,,Autos,,https://www.borm.es/#/home/anuncio/02-01-2009/17009,https://www.borm.es/services/anuncio/358766/pdf,1
BOLETIN,17010,358762,1,2009-01-02 00:00:00.0,Verbal Desahucio Falta Pago 582/2007.,Administraci�n de Justicia,III. Administraci�n de Justicia,,Primera Instancia n�mero Once de Murcia,0,2009,ANUNCIO,,,Autos,,https://www.borm.es/#/home/anuncio/02-01-2009/17010,https://www.borm.es/services/anuncio/358762/pdf,2
BOLETIN,17011,358684,1,2009-01-02 00:00:00.0,Proceso n�mero 1279/08.,Administraci�n de Justicia,III. Administraci�n de Justicia,,De lo Social n�mero Siete de Murcia,0,2009,ANUNCIO,,,Autos,,https://www.borm.es/#/home/anuncio/02-01-2009/17011,https://www.borm.es/services/anuncio/358684/pdf,1
BOLETIN,17012,358685,1,2009-01-02 00:00:00.0,Proceso n�mero 1131/08.,Administraci�n de Justicia,III. Administraci�n de Justicia,,De lo Social n�mero Siete de Murcia,0,2009,ANUNCIO,,,Autos,,https://www.borm.es/#/home/anuncio/02-01-2009/17012,https://www.borm.es/services/anuncio/358685/pdf,1
BOLETIN,17014,358767,1,2009-01-02 00:00:00.0,Demanda 1230/2008.,Administraci�n de Justicia,III. Administraci�n de Justicia,,De lo Social n�mero Dos de Murcia,0,2009,ANUNCIO,,,Demandas,,https://www.borm.es/#/home/anuncio/02-01-2009/17014,https://www.borm.es/services/anuncio/358767/pdf,2
BOLETIN,17016,358768,1,2009-01-02 00:00:00.0,Demanda 1229/2008.,Administraci�n de Justicia,III. Administraci�n de Justicia,,De lo Social n�mero Dos de Murcia,0,2009,ANUNCIO,,,Demandas,,https://www.borm.es/#/home/anuncio/02-01-2009/17016,https://www.borm.es/services/anuncio/358768/pdf,2
BOLETIN,17017,358694,1,2009-01-02 00:00:00.0,Convocatoria de la concesi�n de subvenciones por el Ayuntamiento de Alcantarilla en el �mbito de los programas de Educaci�n F�sica y Deportes para el a�o 2009.,Administraci�n Local,IV. Administraci�n Local,,Alcantarilla,0,2009,ANUNCIO,,,Ayudas/subvenciones - Bases reguladoras/Convocatorias,,https://www.borm.es/#/home/anuncio/02-01-2009/17017,https://www.borm.es/services/anuncio/358694/pdf,1
BOLETIN,17019,358696,1,2009-01-02 00:00:00.0,Caducidad de inscripciones padronales.,Administraci�n Local,IV. Administraci�n Local,,Cieza,0,2009,ANUNCIO,,,Anuncios - Inscripciones/Bajas,,https://www.borm.es/#/home/anuncio/02-01-2009/17019,https://www.borm.es/services/anuncio/358696/pdf,2
BOLETIN,17020,358702,1,2009-01-02 00:00:00.0,Acuerdo de Junta de Gobierno Local del Ayuntamiento de Lorca, de 28 de noviembre de 2008, sobre nombramiento de funcionarios.,Administraci�n Local,IV. Administraci�n Local,,Lorca,0,2009,ANUNCIO,,,Personal - Ceses/Nombramientos,,https://www.borm.es/#/home/anuncio/02-01-2009/17020,https://www.borm.es/services/anuncio/358702/pdf,2
BOLETIN,17023,358710,1,2009-01-02 00:00:00.0,Notificaci�n a interesados.,Administraci�n Local,IV. Administraci�n Local,,San Pedro del Pinatar,0,2009,ANUNCIO,,,Urbanismo,,https://www.borm.es/#/home/anuncio/02-01-2009/17023,https://www.borm.es/services/anuncio/358710/pdf,1
BOLETIN,17025,358711,1,2009-01-02 00:00:00.0,Relaci�n de veh�culos abandonados en el dep�sito municipal de veh�culos.,Administraci�n Local,IV. Administraci�n Local,,San Pedro del Pinatar,0,2009,ANUNCIO,,,Notificaciones - Veh�culos abandonados,,https://www.borm.es/#/home/anuncio/02-01-2009/17025,https://www.borm.es/services/anuncio/358711/pdf,2
BOLETIN,17026,358761,1,2009-01-02 00:00:00.0,Procedimiento: Expediente de dominio. Reanudaci�n del Tracto 1077/2008.,Administraci�n de Justicia,III. Administraci�n de Justicia,,Primera Instancia n�mero Seis de Molina de Segura,0,2009,ANUNCIO,,,Expedientes de dominio,,https://www.borm.es/#/home/anuncio/02-01-2009/17026,https://www.borm.es/services/anuncio/358761/pdf,1
BOLETIN,17029,358750,1,2009-01-02 00:00:00.0,Demanda 427/2008. M.C.,Administraci�n de Justicia,III. Administraci�n de Justicia,,De lo Social n�mero Uno de Cartagena,0,2009,ANUNCIO,,,Demandas,,https://www.borm.es/#/home/anuncio/02-01-2009/17029,https://www.borm.es/services/anuncio/358750/pdf,2
BOLETIN,17030,358752,1,2009-01-02 00:00:00.0,Demanda 285/2008.,Administraci�n de Justicia,III. Administraci�n de Justicia,,De lo Social n�mero Uno de Cartagena,0,2009,ANUNCIO,,,Demandas,,https://www.borm.es/#/home/anuncio/02-01-2009/17030,https://www.borm.es/services/anuncio/358752/pdf,1
BOLETIN,17031,358754,1,2009-01-02 00:00:00.0,Autos 511/2008-P.,Administraci�n de Justicia,III. Administraci�n de Justicia,,De lo Social n�mero Uno de Cartagena,0,2009,ANUNCIO,,,Autos,,https://www.borm.es/#/home/anuncio/02-01-2009/17031,https://www.borm.es/services/anuncio/358754/pdf,1
BOLETIN,17033,358753,1,2009-01-02 00:00:00.0,Demanda n�mero 2/2008.,Administraci�n de Justicia,III. Administraci�n de Justicia,,De lo Social n�mero Uno de Cartagena,0,2009,ANUNCIO,,,Demandas,,https://www.borm.es/#/home/anuncio/02-01-2009/17033,https://www.borm.es/services/anuncio/358753/pdf,2
BOLETIN,17034,358755,1,2009-01-02 00:00:00.0,Demanda 618/2008.,Administraci�n de Justicia,III. Administraci�n de Justicia,,De lo Social n�mero Uno de Cartagena,0,2009,ANUNCIO,,,Demandas,,https://www.borm.es/#/home/anuncio/02-01-2009/17034,https://www.borm.es/services/anuncio/358755/pdf,1
BOLETIN,17035,358686,1,2009-01-02 00:00:00.0,Juicio de faltas 59/2008.,Administraci�n de Justicia,III. Administraci�n de Justicia,,Instrucci�n n�mero Dos de Totana,0,2009,ANUNCIO,,,Juicio de faltas,,https://www.borm.es/#/home/anuncio/02-01-2009/17035,https://www.borm.es/services/anuncio/358686/pdf,1
BOLETIN,17036,358697,1,2009-01-02 00:00:00.0,Adjudicaci�n de obras "Centro de atenci�n a la infancia en pol�gono industrial Los Prados".,Administraci�n Local,IV. Administraci�n Local,,Cieza,0,2009,ANUNCIO,,,Contrataci�n - Adjudicaciones,,https://www.borm.es/#/home/anuncio/02-01-2009/17036,https://www.borm.es/services/anuncio/358697/pdf,1
BOLETIN,17037,358687,1,2009-01-02 00:00:00.0,Juicio de faltas 74/2008.,Administraci�n de Justicia,III. Administraci�n de Justicia,,Instrucci�n n�mero Dos de Totana,0,2009,ANUNCIO,,,Juicio de faltas,,https://www.borm.es/#/home/anuncio/02-01-2009/17037,https://www.borm.es/services/anuncio/358687/pdf,1
BOLETIN,17038,358689,1,2009-01-02 00:00:00.0,Juicio de faltas 80/2008.,Administraci�n de Justicia,III. Administraci�n de Justicia,,Instrucci�n n�mero Dos de Totana,0,2009,ANUNCIO,,,Juicio de faltas,,https://www.borm.es/#/home/anuncio/02-01-2009/17038,https://www.borm.es/services/anuncio/358689/pdf,1
BOLETIN,17039,358699,1,2009-01-02 00:00:00.0,Contrataci�n de servicios.,Administraci�n Local,IV. Administraci�n Local,,Cieza,0,2009,ANUNCIO,,,Contrataci�n - Licitaciones,,https://www.borm.es/#/home/anuncio/02-01-2009/17039,https://www.borm.es/services/anuncio/358699/pdf,2
BOLETIN,17040,358688,1,2009-01-02 00:00:00.0,Juicio de faltas 121/2008.,Administraci�n de Justicia,III. Administraci�n de Justicia,,Instrucci�n n�mero Dos de Totana,0,2009,ANUNCIO,,,Juicio de faltas,,https://www.borm.es/#/home/anuncio/02-01-2009/17040,https://www.borm.es/services/anuncio/358688/pdf,1
BOLETIN,17041,358698,1,2009-01-02 00:00:00.0,Contrataci�n de servicios de limpieza.,Administraci�n Local,IV. Administraci�n Local,,Cieza,0,2009,ANUNCIO,,,Contrataci�n - Licitaciones,,https://www.borm.es/#/home/anuncio/02-01-2009/17041,https://www.borm.es/services/anuncio/358698/pdf,2
BOLETIN,17042,358690,1,2009-01-02 00:00:00.0,Juicio de faltas 64/2008.,Administraci�n de Justicia,III. Administraci�n de Justicia,,Instrucci�n n�mero Dos de Totana,0,2009,ANUNCIO,,,Juicio de faltas,,https://www.borm.es/#/home/anuncio/02-01-2009/17042,https://www.borm.es/services/anuncio/358690/pdf,2
BOLETIN,17043,358749,1,2009-01-02 00:00:00.0,Juicio de faltas 823/2007.,Administraci�n de Justicia,III. Administraci�n de Justicia,,Instrucci�n n�mero Dos de Cartagena,0,2009,ANUNCIO,,,Juicio de faltas,,https://www.borm.es/#/home/anuncio/02-01-2009/17043,https://www.borm.es/services/anuncio/358749/pdf,1
BOLETIN,17046,358769,1,2009-01-02 00:00:00.0,Procedimiento ejecuci�n 157/2008.,Administraci�n de Justicia,III. Administraci�n de Justicia,,De lo Social n�mero Cuatro de Murcia,0,2009,ANUNCIO,,,Autos,,https://www.borm.es/#/home/anuncio/02-01-2009/17046,https://www.borm.es/services/anuncio/358769/pdf,1
BOLETIN,17047,358717,1,2009-01-02 00:00:00.0,Procedimiento demanda 403/2008.,Administraci�n de Justicia,III. Administraci�n de Justicia,,De lo Social n�mero Cinco de Murcia,0,2009,ANUNCIO,,,Demandas,,https://www.borm.es/#/home/anuncio/02-01-2009/17047,https://www.borm.es/services/anuncio/358717/pdf,2
BOLETIN,17048,358718,1,2009-01-02 00:00:00.0,Procedimiento demanda 689/2008.,Administraci�n de Justicia,III. Administraci�n de Justicia,,De lo Social n�mero Cinco de Murcia,0,2009,ANUNCIO,,,Demandas,,https://www.borm.es/#/home/anuncio/02-01-2009/17048,https://www.borm.es/services/anuncio/358718/pdf,1
BOLETIN,17049,358719,1,2009-01-02 00:00:00.0,Autos 114/2008.,Administraci�n de Justicia,III. Administraci�n de Justicia,,De lo Social n�mero Cinco de Murcia,0,2009,ANUNCIO,,,Autos,,https://www.borm.es/#/home/anuncio/02-01-2009/17049,https://www.borm.es/services/anuncio/358719/pdf,1
BOLETIN,17050,358720,1,2009-01-02 00:00:00.0,Autos 423/2208.,Administraci�n de Justicia,III. Administraci�n de Justicia,,De lo Social n�mero Cinco de Murcia,0,2009,ANUNCIO,,,Autos,,https://www.borm.es/#/home/anuncio/02-01-2009/17050,https://www.borm.es/services/anuncio/358720/pdf,1
BOLETIN,17051,358756,1,2009-01-02 00:00:00.0,Autos 1.144/2008-JM.,Administraci�n de Justicia,III. Administraci�n de Justicia,,De lo Social n�mero Uno de Cartagena,0,2009,ANUNCIO,,,Autos,,https://www.borm.es/#/home/anuncio/02-01-2009/17051,https://www.borm.es/services/anuncio/358756/pdf,1
BOLETIN,17052,358757,1,2009-01-02 00:00:00.0,Autos 946/2008-JM.,Administraci�n de Justicia,III. Administraci�n de Justicia,,De lo Social n�mero Uno de Cartagena,0,2009,ANUNCIO,,,Autos,,https://www.borm.es/#/home/anuncio/02-01-2009/17052,https://www.borm.es/services/anuncio/358757/pdf,1
BOLETIN,17053,358682,1,2009-01-02 00:00:00.0,Demanda 856/2008.,Administraci�n de Justicia,III. Administraci�n de Justicia,,De lo Social n�mero Seis de Murcia,0,2009,ANUNCIO,,,Demandas,,https://www.borm.es/#/home/anuncio/02-01-2009/17053,https://www.borm.es/services/anuncio/358682/pdf,1
BOLETIN,17054,358758,1,2009-01-02 00:00:00.0,Autos 530/2008-P.,Administraci�n de Justicia,III. Administraci�n de Justicia,,De lo Social n�mero Uno de Cartagena,0,2009,ANUNCIO,,,Autos,,https://www.borm.es/#/home/anuncio/02-01-2009/17054,https://www.borm.es/services/anuncio/358758/pdf,1
BOLETIN,17055,358691,1,2009-01-02 00:00:00.0,Recurso de suplicaci�n 1.854/2008.,Administraci�n de Justicia,III. Administraci�n de Justicia,,Tribunal Superior de Justicia de Andaluc�a - Sala de lo Social con sede en Granada,0,2009,ANUNCIO,,,Recursos,,https://www.borm.es/#/home/anuncio/02-01-2009/17055,https://www.borm.es/services/anuncio/358691/pdf,1
BOLETIN,17076,358759,1,2009-01-02 00:00:00.0,Procedimiento n�mero 76/2008.,Administraci�n de Justicia,III. Administraci�n de Justicia,,Primera Instancia n�mero Dos de Cieza,0,2009,ANUNCIO,,,Ejecuciones judiciales - Hipotecarias,,https://www.borm.es/#/home/anuncio/02-01-2009/17076,https://www.borm.es/services/anuncio/358759/pdf,2
BOLETIN,17099,358704,1,2009-01-02 00:00:00.0,Solicitud de Licencia Municipal para establecer la actividad de bar con cocina.,Administraci�n Local,IV. Administraci�n Local,,Los Alc�zares,0,2009,ANUNCIO,,,Autorizaciones/Solicitudes - Licencias de apertura,,https://www.borm.es/#/home/anuncio/02-01-2009/17099,https://www.borm.es/services/anuncio/358704/pdf,1
BOLETIN,17103,358683,1,2009-01-02 00:00:00.0,Procedimiento n�mero 838/2007.,Administraci�n de Justicia,III. Administraci�n de Justicia,,De lo Social n�mero Siete de Murcia,0,2009,ANUNCIO,,,Demandas,,https://www.borm.es/#/home/anuncio/02-01-2009/17103,https://www.borm.es/services/anuncio/358683/pdf,3
BOLETIN,17121,358700,1,2009-01-02 00:00:00.0,Anuncio de licitaci�n para venta de parcelas en el Pol�gono Industrial de Lo Bolar�n (La Uni�n).,Administraci�n Local,IV. Administraci�n Local,,La Uni�n,0,2009,ANUNCIO,,,Contrataci�n - Licitaciones,,https://www.borm.es/#/home/anuncio/02-01-2009/17121,https://www.borm.es/services/anuncio/358700/pdf,1
BOLETIN,17386,358739,1,2009-01-02 00:00:00.0,Anuncio de contrataci�n. Expediente II-6/09.,Comunidad Aut�noma,I. Comunidad Aut�noma,4. Anuncios,Consejer�a de Agricultura y Agua,0,2009,ANUNCIO,,,Contrataci�n - Licitaciones,,https://www.borm.es/#/home/anuncio/02-01-2009/17386,https://www.borm.es/services/anuncio/358739/pdf,1
BOLETIN,17387,358737,1,2009-01-02 00:00:00.0,Anuncio de contrataci�n. Expediente II-4/09.,Comunidad Aut�noma,I. Comunidad Aut�noma,4. Anuncios,Consejer�a de Agricultura y Agua,0,2009,ANUNCIO,2008-12-18 00:00:00.0,2008,Notificaciones - Expediente sancionador,,https://www.borm.es/#/home/anuncio/02-01-2009/17387,https://www.borm.es/services/anuncio/358737/pdf,2
BOLETIN,17388,358715,1,2009-01-02 00:00:00.0,Anuncio de adjudicaci�n definitiva del contrato de servicios de redacci�n del plan director de abastecimiento de agua potable y saneamiento del municipio de Yecla" (C.SE. n.� 10/2008).,Administraci�n Local,IV. Administraci�n Local,,Yecla,0,2009,ANUNCIO,,,Contrataci�n - Adjudicaciones,,https://www.borm.es/#/home/anuncio/02-01-2009/17388,https://www.borm.es/services/anuncio/358715/pdf,1
BOLETIN,17557,358730,1,2009-01-02 00:00:00.0,Pr�rroga para 2009, del Convenio de colaboraci�n suscrito el d�a 2 de enero de 2006 entre la Comunidad Aut�noma de la Regi�n de Murcia, a trav�s de la Consejer�a de Sanidad y el Ilustre Colegio Oficial de Farmac�uticos de la Regi�n de Murcia, en materia de Tasas afectadas por la tramitaci�n y resoluci�n de expedientes de Farmacia.,Comunidad Aut�noma,I. Comunidad Aut�noma,3. Otras Disposiciones,Consejer�a de Sanidad y Consumo,0,2009,CONVENIO,2008-11-26 00:00:00.0,2008,Convenios,,https://www.borm.es/#/home/anuncio/02-01-2009/17557,https://www.borm.es/services/anuncio/358730/pdf,2
BOLETIN,17621,358731,1,2009-01-02 00:00:00.0,Orden del Excmo. Sr. Consejero de Obras P�blicas y Ordenaci�n del Territorio, de 28 de noviembre de 2008, relativa la aprobaci�n definitiva de subsanaci�n de deficiencias del plan general municipal de ordenaci�n de Molina de Segura. Expte.: 263/04 de planeamiento,Comunidad Aut�noma,I. Comunidad Aut�noma,3. Otras Disposiciones,Consejer�a de Obras P�blicas y Ordenaci�n del Territorio,0,2009,ORDEN,2008-11-28 00:00:00.0,2008,Urbanismo,,https://www.borm.es/#/home/anuncio/02-01-2009/17621,https://www.borm.es/services/anuncio/358731/pdf,3
BOLETIN,17622,358732,1,2009-01-02 00:00:00.0,Orden del Excmo. Sr. Consejero de Obras P�blicas y Ordenaci�n del Territorio de 2 de diciembre de 2008, relativa la toma de conocimiento de la modificaci�n n.� 120 del Plan General Municipal de Ordenaci�n de Cartagena en la finca "Buenos Aires" de Molinos Marfagones. Expte.: 160/05 de planeamiento.,Comunidad Aut�noma,I. Comunidad Aut�noma,3. Otras Disposiciones,Consejer�a de Obras P�blicas y Ordenaci�n del Territorio,0,2009,ORDEN,2008-12-02 00:00:00.0,2008,Urbanismo,,https://www.borm.es/#/home/anuncio/02-01-2009/17622,https://www.borm.es/services/anuncio/358732/pdf,3